{"text_format":"1","workbook":"xlsx","n_sheets":5,"sheets":["READ ME, please","1 Land Use","2 Report","calc","Backend"],"not_rendered":{"charts":0,"images":38,"macros":1,"external_links":0,"defined_names":0,"comments":2,"pivot_tables":0},"unopened":[],"bounds":{"document_bytes":16777216,"sheet_cells":100000,"rows_first":2000,"rows_last":500,"rows_between":2000,"halvings":0,"cell_chars":16384,"cell_head_chars":4096},"cells_cut":0,"cells_raw":0,"read":"whole","date_system":"1900"}

{"sheet":"READ ME, please","index":0,"n_rows":67,"n_cols":3,"rows_kept":67,"cut":false,"hidden":false,"merged":[]}
[]
[null,"This is the WFRC parking management planning tool. Its purpose is to provide planning-level parking reduction estimates for developments within the jurisdiction of the Wasatch Front Regional Council."]
[]
[null,"STEP ONE, select the 1 Land Use tab to enter details about the project. The first four cells are where the user should type in the following details:"]
[null,null,"Project Name"]
[null,null,"Lead Agency"]
[null,null,"Project Location"]
[null,null,"Analyst"]
[]
[]
{"$rows_left_out":58}
{"sheet":"1 Land Use","index":1,"n_rows":49,"n_cols":45,"rows_kept":49,"cut":false,"hidden":false,"merged":[[48,2,50,54],[3,29,3,55],[6,1,6,27],[3,1,3,27],[6,29,6,55],[45,2,45,54]]}
[null,"Input data here"]
[]
[null,"Project Name",null,null,null,null,null,null,null,null,null,null,null,null,null,null,null,null,null,null,null,null,null,null,null,null,null,null,null,"Lead Agency"]
[null,"Insert project name here",null,null,null,null,null,null,null,null,null,null,null,null,null,null,null,null,null,null,null,null,null,null,null,null,null,null,null,"Insert lead agency here"]
[]
[null,"Project Location (address, city, district)",null,null,null,null,null,null,null,null,null,null,null,null,null,null,null,null,null,null,null,null,null,null,null,null,null,null,null,"Analyst"]
[null,"Insert project location details here",null,null,null,null,null,null,null,null,null,null,null,null,null,null,null,null,null,null,null,null,null,null,null,null,null,null,null,"Insert analyst details here"]
[]
[]
[]
{"$rows_left_out":40}
{"sheet":"2 Report","index":2,"n_rows":53,"n_cols":42,"rows_kept":53,"cut":false,"hidden":false,"merged":[[2,0,3,46],[10,41,12,45],[14,33,14,35],[7,23,8,27],[7,29,8,33],[7,35,8,39],[7,41,8,45],[14,1,14,20],[7,1,7,20],[10,23,12,27],[10,29,12,33],[10,35,12,39],[30,0,31,46],[4,0,5,46],[15,23,15,31],[14,23,14,31],[15,33,15,35],[18,23,18,33],[18,35,18,45],[17,23,17,45],[10,1,11,20],[17,1,17,20],[22,1,25,13],[22,16,22,45],[26,16,26,45],[28,16,28,45],[24,16,24,45],[26,1,28,13],[41,0,42,46],[33,1,33,45],[35,1,35,45],[37,1,37,45],[39,1,39,45],[44,1,44,45],[46,1,46,45],[48,1,48,45],[50,1,50,45],[52,1,52,45]]}
[]
[]
["Options to Modernize Parking"]
[]
["Project Description"]
[]
[]
[null,{"$f":"IF(\"\"='1 Land Use'!B4,\"\",'1 Land Use'!B4)","v":"Insert project name here"},null,null,null,null,null,null,null,null,null,null,null,null,null,null,null,null,null,null,null,null,null,"Project Area",null,null,null,null,null,"Intersection Density",null,null,null,null,null,"Transit Infrastructure",null,null,null,null,null,"Bike Infrastructure"]
[]
[]
{"$rows_left_out":44}
{"sheet":"calc","index":3,"n_rows":55,"n_cols":34,"rows_kept":55,"cut":false,"hidden":true,"merged":[[0,29,1,30],[0,32,1,35],[1,18,1,22],[26,12,26,13],[26,14,26,15],[1,6,1,13],[35,12,35,13],[35,14,35,15],[35,7,35,8],[26,7,26,8],[26,9,26,10],[35,9,35,10]]}
[null,null,"Input",null,null,null,null,null,null,null,null,null,null,null,null,null,null,null,null,null,null,null,null,null,null,null,null,null,null,"On-street and off-street parking don't actually affect anything right now.",null,null,"Lower Parking Minimums & Eliminating Parking Minimums should not occur together"]
[null,null,"Input Name","Value","Desc",null,"Effectiveness of reductions. Higher numbers mean the reductions will be more effective.",null,null,null,null,null,null,null,{"$f":"PRODUCT(O4:O9)","v":0.76949999999999996},null,null,"Strategies Affected by Area Settings","Enter a \"1\" if the effectiveness is affected the area settings from columns U-Z"]
[null,null,"Project Name",{"$f":"'1 Land Use'!B4","v":"Insert project name here"},null,null,null,1,2,3,4,5,true,false,"Effectiveness"]
[null,null,"Project Location (address, city, district)",{"$f":"'1 Land Use'!B7","v":"Insert project location details here"},null,null,{"$f":"C8","v":"Area Setting (Rural -> Urban)"},0.5,0.7,0.8,0.9,1,0,0,{"$f":"INDEX($H4:$N4,1,MATCH($D8,$H$3:$N$3,0))","v":0.9},null,null,null,{"$f":"C8","v":"Area Setting (Rural -> Urban)"},{"$f":"C9","v":"Intersection Density"},{"$f":"C10","v":"Transit Infrastructure"},{"$f":"C11","v":"Bike Infrastructure"},{"$f":"C12","v":"Parking allowed On-Street"},{"$f":"C13","v":"Parking allowed Off-Street"},"Land Use","Area Setting (Rural,Urban)","Intersection Density","Transit Infrastructure","Bike Infrastructure","Parking allowed On-Street","Parking allowed Off-Street","Land Uses","Mutual Exclusions","Active"]
[null,null,"Lead Agency",{"$f":"'1 Land Use'!AD4","v":"Insert lead agency here"},null,null,"Intersection Density",0.8,0.85,0.9,0.95,1,0,0,0.95,null,null,"Lower Parking Minimums",345,2345,123,123,12,12,null,{"$f":"IFERROR(SEARCH($D$8,S5),0)","v":2},{"$f":"IFERROR(SEARCH($D$9,T5),0)","v":3},{"$f":"IFERROR(SEARCH($D$10,U5),0)","v":3},{"$f":"IFERROR(SEARCH($D$11,V5),0)","v":2},{"$f":"IFERROR(SEARCH($E$12,W5),1)","v":1},{"$f":"IFERROR(SEARCH($E$13,X5),1)","v":1},null,{"$f":"IF($D$30=FALSE,1,0)","v":1},{"$f":"PRODUCT(Z5:AG5)","v":36}]
[null,null,"Analyst",{"$f":"'1 Land Use'!AD7","v":"Insert analyst details here"},null,null,"Transit Infrastructure",0.5,0.75,1,0,0,0,0,1,null,null,"Eliminating Parking Minimums",45,345,123,123,12,12,null,1,2,3,{"$f":"IFERROR(SEARCH($S$40,V6),0)","v":1},1,1,null,{"$f":"IF($D$29=FALSE,1,0)","v":1},{"$f":"PRODUCT(Z6:AG6)","v":6}]
[null,null,null,null,null,null,"Bike Infrastructure",0.8,0.9,1,0,0,0,0,0.9,null,null,"Parking Maxima",12345,12345,123,123,12,12,null,4,4,3,1,1,1,null,null,48]
[null,null,"Area Setting (Rural -> Urban)",4,"1=rural, 5=TOD",null,"Parking allowed On-Street",0,0,0,0,0,1,1,1,null,null,"Shared Parking Policy",45,345,123,123,12,12,null,1,2,3,1,1,1,null,null,6]
[null,null,"Intersection Density",4,"1 = very sparse, 5=very dense",null,"Parking allowed Off-Street",0,0,0,0,0,1,1,1,null,null,"Bicycle Parking Policy ",45,345,123,123,12,12,null,1,2,3,1,1,1,null,null,6]
[null,null,"Transit Infrastructure",3,"1=none, 3=comprehensive",null,null,null,null,null,null,null,null,null,null,null,null,"Unbundle/Price Residential Parking",12345,12345,123,123,12,12,2,4,4,3,1,1,1,{"$f":"IFERROR(IF($D$19,SEARCH($E$19,Y10),0),0) + IFERROR(IF($D$20,SEARCH($E$20,Y10),0),0) + IFERROR(IF($D$21,SEARCH($E$21,Y10),0),0) + IFERROR(IF($D$22,SEARCH($E$22,Y10),0),0) + IFERROR(IF($D$23,SEARCH($E$23,Y10),0),0) + IFERROR(IF($D$24,SEARCH($E$24,Y10),0),0) + IFERROR(IF($D$25,SEARCH($E$25,Y10),0),0)","v":1},null,{"$f":"PRODUCT(Z10:AF10)","v":48}]
{"$rows_left_out":46}
{"sheet":"Backend","index":4,"n_rows":22,"n_cols":52,"rows_kept":22,"cut":false,"hidden":true,"merged":[[0,4,0,5],[0,30,0,33],[0,29,1,29],[0,15,0,19],[0,44,0,45],[0,20,0,28],[0,34,0,42],[0,43,1,43],[0,6,0,9],[0,10,0,14]]}
[null,null,null,null,"Effects",null,"Issues that need Addressing (On-Street Parking)",null,null,null,"Issues that need Addressing (Off-Street Parking)",null,null,null,null,"Suitable Transects",null,null,null,null,"Suitable Land Uses",null,null,null,null,null,null,null,null,"Needed Code and Policy Support","Transit Station Parking",null,null,null,"Mode Shift Potential by Land Use",null,null,null,null,null,null,null,null,"Potential for Revenue Generation","Parking Reduction Potentail"]
["Row Height","Sort","Name of Strategy","Description/Examples","Short-Term","Long-Term","Residents cannot find spaces in their neighborhood","Convenient spaces are not available to retail shoppers","On-street parking is difficult to find","Traffic Congestion occurs as driver search for on-street parking","Convenient spaces are not available to shoppers in commercial areas","Parking lots and structures are usually full","Parking patterns are uneven","Parking \"poaching\" is occuring where patrons from one use occupy parking provided for another use","Cars are parked for long periods of time, excluding daily parkers.","TOD","Urban Core","Urban/\nMixed-Use","Suburban","Rural","Industrial","Residential","Lodging","Recreational","Institutional","Office","Retail","Service","Other",null,"Transit Station Parking","Required available access modes","Required quality of transit network","Required quality of ped/bike network","Industrial","Residential","Lodging","Recreational","Institutional","Office","Retail","Service","Other",null,"Low","High","Implementation Notes","Sources"]
[100,1,"Lower Parking Minimums (Policy)","     This measure involves reducing the minimum parking supply required at a new development. By not forcing a higher minimum parking ratio, it allows the developers and landowners with added flexibility to provide parking that is context sensitive and avoid building excess parking supplies that is never utilized.\nExample: Reducing parking requirements for residential developments from 1.5 stalls/unit to 1 stall/unit","Less parking required at developments, more complains that there isn't enough parking","Higher development density and reduced car ownership",1,1,1,null,1,1,1,1,1,1,1,1,1,1,1,1,1,1,1,1,1,1,1,1,"1,2,3",1,null,null,1,2,2,2,2,2,2,2,2,null,0,0,null,null,0.1,0.3]
[100,2,"Eliminating Parking Minimums (Policy)","This Policy measure is a bold policy approach that entails eliminating the requirement that new developments provide a minimum number of parking spaces. This shift in policy has gained traction as a means to address a variety of urban challenges and promote a more sustainable and people-centered development. However, eliminating parking minimums may not be suitable for all communities or development settings.\nExample: Parking requirements for residential developments are elimited entirely. No parking would be required to be provided.","Less parking required at developments, more complains that there isn't enough parking","Higher development density and reduced car ownership",1,1,1,null,1,1,1,1,1,1,null,null,null,null,1,1,1,1,1,1,1,1,1,1,5,3,3,3,3,3,3,3,3,3,3,3,3,null,0,0,null,null,0.1,0.3]
[100,3,"Parking Maxima Policy","This policy involves setting an upper limit on the number of parking spaces allowed for a specific development or area. Unlike minimum parking requirements, which require a minimum number of parking spaces, parking maximums limit excessive parking supply Many times oversupply of parking is caused by developers providing more parking than is required by the municipal code.\nExample: Parking requirements for residential developments would cap parking at 1.5 stalls/unit, but fewer stalls would also be permitted.","Less parking required at developments, more complains that there isn't enough parking","Higher development density and reduced car ownership",1,1,1,null,1,1,1,1,1,1,1,1,1,1,1,1,1,1,1,1,1,1,1,1,"1,2,3,4,5",1,null,null,1,2,2,2,2,2,2,2,2,null,0,0,null,"(1) California Department of Transportation (Caltrans). 2012. California Household Travel Survey (CHTS). Available: https://www.nrel.gov/transportation/secure-transportation-data/tsdc-california-travelsurvey.html. Accessed: January 2021.  \n\n(2) Chatman, D. 2013. Does TOD need the T? On the importance of factors other than rail access. Journal of the American Planning Association 79(1). Available: https://trid.trb.org/view/1243004 . Accessed: January 2021.  \n\n(3) Institute of Transportation Engineers (ITE). 2019. Parking Generation Manual. 5th Edition. February. Available: https://ecommerce.ite.org/IMIS/ItemDetail?iProductCode=PG5-ALL. Accessed: May 2021.",0.1,0.3]
[100,4,"Shared Parking Policy","A shared parking policy allows for two or more land uses to share parking spaces without conflict or encroachment. The ability to share parking spaces is the result of two conditions: Variations in the accumulation of vehicles by hour, by day, or by season at the individual land uses; or/and relationships among the land uses that result in visiting multiple land uses on the same auto trip.Shared parking can maximize the use and efficiency of existing parking facilities, reduce the need to provide more parking, and enable more compact development.Example: allow for reduced parking supply at mixed-use developments.","Less parking required at mixed-use developments, parking demand occasionally exceeds capacity.","Higher development density; Reduced parking facility costs; Reduces paved area",null,1,null,1,1,1,1,null,null,1,1,1,1,1,null,1,1,1,1,1,1,1,1,1,"1,2,3,4,5",1,null,null,null,1,1,1,1,1,1,1,1,null,0,0,"Shared Parking does not directly reduce vehicle travel if it substitutes for increased parking supply.","(1) VTPI, 2015. Shared Parking: Sharing Parking Facilities Among Multiple Users. Available: https://www.vtpi.org/tdm/tdm89.htm. Accessed October 2022",0.1,0.3]
[100,5,"Bicycle Parking Policy","A progressive bicycle policy can play a significant role in reducing parking demand by encouraging the use of active transportation options and reducing the need for personal vehicles. This policy can include reducing vehicular parking requirements if developments propose a certain number of long-term and short-bicycle parking in addition to other bicycle amenities like showers facilites, lockers, etc at developments. The policy could also include systemwide investment in improvement to bicycle infrastructure, and amenities.  \n\nExample: Zoning code may allow replacement of up to 30% of off-street automobile parking requirements for commercial  and 10% for residential and hotel uses with bicycle parking. ","Less automobile parking and encourages quality bicycle parking and amenities","Encourages active transportation mode and reduces SOV travel",null,null,null,null,null,null,null,null,null,1,1,1,null,null,null,null,1,1,null,1,1,1,1,1,null,null,null,null,null,null,null,null,null,null,null,null,null,null,0,0,null,null,0.05,0.15,4.3999999999999997E-2,0.25]
[100,6,"Unbundle or Price Residential Parking","This strategy involves separating the cost of leasing or owning a parking space from the cost of leasing or owning a residential unit. Unbundling parking decouples the cost of parking from the unit and requires the resident to make a choice whether they want to pay extra to own and park their car or not. It provides the flexibility to only use parking if they need it and has the effect of reducing car ownership and parking demand while encouraging non-automobile travel. \nExample: Each parking space at a residential development incurs a monthly fee and can be opted out of.","Less parking required at residential developments, complains that parking is too expensive.","Higher development density and reduced car ownership",null,1,1,1,1,1,1,1,1,1,1,1,1,null,null,1,null,null,null,null,null,null,null,null,"1,2",1,null,null,null,3,null,null,null,null,null,null,null,2,0.1,0.3,null,"(1) AAA. 2019. Your Driving Costs. September. Available: https://exchange.aaa.com/wpcontent/uploads/2019/09/AAA-Your-Driving-Costs-2019.pdf. Accessed: January 2021.  \n\n(2) Federal Highway Administration (FHWA). 2017. National Household Travel Survey – 2017 Table Designer. Annual VMT / Vehicle by Count of Household Vehicles in California. Available: https://nhts.ornl.gov/. Accessed: March 2021.  \n\n(3) Litman, T. 2020. Parking Requirement Impacts on Housing Affordability. June. Available: https://www.vtpi.org/park-hou.pdf. Accessed: January 2021.",1.4999999999999999E-2,0.08]
[100,7,"Enhanced Transit","Investments in high quality, frequent and reliable transit network can be a game changer in reducing parking demand by providing commuters and other travels an attractive alternative to driving and as a result reduce parking demand both at origin and destination of trips. A successfully operated transit network can provide convenient access to destinations and encourages people to shift their travel mode, further reducing investments in expensive roadway/freeway capacity improvements.\nSmall-scale example: Transit headways or fees are reduced\nLarge-scale example: Rail lines are double-tracked or electrified allowing for higher speeds and shorter travel times","Less reliance on cars, increased transit ridership, minimal effect on car ownership","Transit-oriented development, population growth, increased residential and employement density, reduced car ownership.",1,1,1,1,1,1,null,null,null,1,1,1,null,null,null,1,1,1,1,1,1,1,1,null,"1,2,3",3,"0,1,2",null,1,2,2,2,2,2,2,2,2,1,0.1,0.3,null,"(1) Transport Review. 2016. Long-term impacts of transport infrastructure networks on land-use change: an international review of empirical studies. Available: https://www.tandfonline.com/doi/full/10.1080/01441647.2016.1168887. Accessed October 2022.",4.4999999999999998E-2,5.5E-2]
[100,8,"Enhanced Ped & Bike Networks","Enhancing pedestrian and bike infrastructure such as sidewalks, crosswalks, bike lanes, protected bike paths, bicycle parking, etc. can incentivize people to not use an automobile to make short trips. A well-connected, safe, low stress, and aesthetically appealing network of active transportation facilities can significantly change the mode share and reduce parking demand. \nExample: Providing protected bike lanes between major origin and destination nodes.","Less reliance on cars, increased walking/biking, minimal effect on car ownership","Walking/biking oriented development, improved health of community, increased residential and employement density, reduced car ownership.",1,1,1,1,1,1,null,null,null,1,1,1,null,null,null,1,1,1,1,1,1,1,1,null,"1,2,3",2,null,"0,1,2",1,2,2,2,2,2,2,2,2,null,0.05,0.15,null,"(1) USDOT. 2019. Expand and Improve Bicycle and Pedestrian Infrastructure. Available: https://www.transportation.gov/mission/health/Expand-and-Improve-Bicycle-and-Pedestrian-Infrastructure. Accessed October 2022.\n(2) PubMed Central. 2014. New Walking and Cycling Routes and Increased Physical Activiy: One- and 2-year findings from the UK iConnect Study. Available: https://www.ncbi.nlm.nih.gov/pmc/articles/PMC4151955/. Accessed October 2022.",2E-3,1E-3]
{"$rows_left_out":12}